BDBM50168776 3-(5-(2'-chloro-2-fluorobiphenyl-4-yl)-1-(4-chlorobenzyl)-3-methyl-1H-indol-2-yl)-2,2-dimethylpropanoic acid::3-[1-(4-Chloro-benzyl)-5-(2'-chloro-2-fluoro-biphenyl-4-yl)-3-methyl-1H-indol-2-yl]-2,2-dimethyl-propionic acid::CHEMBL180617
SMILES Cc1c(CC(C)(C)C(O)=O)n(Cc2ccc(Cl)cc2)c2ccc(cc12)-c1ccc(c(F)c1)-c1ccccc1Cl
InChI Key InChIKey=VHOPZWJNKYEBDX-UHFFFAOYSA-N
Data  2 IC50
  Tab Delimited (TSV)   2D SDfile   Computed 3D by Vconf -m prep SDfile
Find this compound or compounds like it in BindingDB:
Activity Spreadsheet -- Enzyme Inhibition Constant Data from BindingDB
Found 1 hit for monomerid = 50168776
TargetProstaglandin E synthase 2(Homo sapiens (Human))
Merck Frosst Centre For Therapeutic Research
Curated by ChEMBL
LigandPNGBDBM50168776(3-(5-(2'-chloro-2-fluorobiphenyl-4-yl)-1-(4-chloro...)
Affinity DataIC50:  4nM. Assay description: Inhibitory concentration against human prostaglandin E2 synthase (mPGES-1)
In DepthDetails ArticlePubMed